Target
Reverse transcriptase/RNaseH
Ligand
BDBM50050632
Substrate
Meas. Tech.
ChEMBL_195513 (CHEMBL800581)
IC50
190±n/a nM
Citation
 Gussio, RPattabiraman, NZaharevitz, DWKellogg, GETopol, IARice, WGSchaeffer, CAErickson, JWBurt, SK All-atom models for the non-nucleoside binding site of HIV-1 reverse transcriptase complexed with inhibitors: a 3D QSAR approach. J Med Chem 39:1645-50 (1996)  
Target
Name:
Reverse transcriptase/RNaseH
Synonyms:
HIV-1 Reverse Transcriptase RNase H Reverse transcriptase/RNaseH
Type:
PROTEIN
Mol. Mass.:
65229.15
Organism:
Human immunodeficiency virus 1
Description:
ChEMBL_1473730
Residue:
566
  
Inhibitor
Name:
BDBM50050632
Synonyms:
8-ETHYL-6-METHOXY-3-METHYL-8H-1,3A,7,8,9-PENTAAZA-DIBENZO[E,H]AZULENE UK-129485
Type:
Small organic molecule
Emp. Form.:
C17H17N5O
Mol. Mass.:
307.3498
SMILES:
CCN1c2ncccc2-c2ncc(C)n2-c2ccc(OC)nc12
: