Target
Phosphatidylinositol 4,5-bisphosphate 3-kinase catalytic subunit beta isoform
Ligand
BDBM50501413
Substrate
Meas. Tech.
ChEMBL_1656008 (CHEMBL4005478)
EC50
45±n/a nM
Citation
 Perreault, SChandrasekhar, JCui, ZHEvarts, JHao, JKaplan, JAKashishian, AKeegan, KSKenney, TKoditek, DLad, LLepist, EIMcGrath, MEPatel, LPhillips, BTherrien, JTreiberg, JYahiaoui, APhillips, G Discovery of a Phosphoinositide 3-Kinase (PI3K) ?/? Inhibitor for the Treatment of Phosphatase and Tensin Homolog (PTEN) Deficient Tumors: Building PI3K? Potency in a PI3K?-Selective Template by Targeting Nonconserved Asp856. J Med Chem 60:1555-1567 (2017)  
Target
Name:
Phosphatidylinositol 4,5-bisphosphate 3-kinase catalytic subunit beta isoform
Synonyms:
PI3-kinase p110 subunit beta PI3Kbeta PIK3CB Phosphatidylinositol 4,5-bisphosphate 3-kinase catalytic subunit beta (PI3Kbeta) Phosphatidylinositol 4,5-bisphosphate 3-kinase catalytic subunit beta isoform (PI3K) Phosphatidylinositol 4,5-bisphosphate 3-kinase catalytic subunit beta isoform (PI3Kbeta) Phosphatidylinositol-4,5-bisphosphate 3-kinase catalytic subunit beta isoform Phosphoinositide 3-Kinase (PI3K), beta Chain A PtdIns-3-kinase p110
Type:
Enzyme Subunit
Mol. Mass.:
122769.00
Organism:
Homo sapiens (Human)
Description:
P42338
Residue:
1070
  
Inhibitor
Name:
BDBM50501413
Synonyms:
CHEMBL4079545
Type:
Small organic molecule
Emp. Form.:
C21H16ClF2N9O
Mol. Mass.:
483.861
SMILES:
Nc1nc(N[C@@H](C2CC2)c2nc3cccc(Cl)c3c(=O)n2-c2cc[nH]n2)c(C#N)c(n1)C(F)F
: