Target
Tyrosine-protein kinase ZAP-70
Ligand
BDBM50503107
Substrate
Meas. Tech.
ChEMBL_1809401 (CHEMBL4308760)
EC50
420±n/a nM
Citation
 O'Malley, DPAhuja, VFink, BCao, CWang, CSwanson, JWee, SGavai, AVTokarski, JCritton, DPaiva, AAJohnson, BMSzapiel, NXie, D Discovery of Pyridazinone and Pyrazolo[1,5- ACS Med Chem Lett 10:1486-1491 (2019)  
Target
Name:
Tyrosine-protein kinase ZAP-70
Synonyms:
70 kDa zeta-associated protein Syk-related tyrosine kinase Tyrosine-protein kinase ZAP-70 Tyrosine-protein kinase ZAP-70 (ZAP70) ZAP70 Zeta-chain (TCR) associated protein kinase 70kDa
Type:
Enzyme
Mol. Mass.:
69881.61
Organism:
Homo sapiens (Human)
Description:
ZAP-70 SH2 domain was expressed and purified from E. coli using O-phospho-L-tyrosine-agarose column.
Residue:
619
  
Inhibitor
Name:
BDBM50503107
Synonyms:
CHEMBL4437906
Type:
Small organic molecule
Emp. Form.:
C32H39N7O3
Mol. Mass.:
569.6972
SMILES:
CCc1cc(NC(=O)c2nn(C3CCN(CC3)C(=O)NC(C)(C)C)c3ccccc23)ccc1-c1n[nH]c(=O)c(C)c1C
: