Target
5-hydroxytryptamine receptor 2A
Ligand
BDBM50053188
Substrate
Meas. Tech.
ChEMBL_2578 (CHEMBL617600)
IC50
20±n/a nM
Citation
 Andersen, KLiljefors, THyttel, JPerregaard, J Serotonin 5-HT2 receptor, dopamine D2 receptor, and alpha 1 adrenoceptor antagonists. Conformationally flexible analogues of the atypical antipsychotic sertindole. J Med Chem 39:3723-38 (1996)  
Target
Name:
5-hydroxytryptamine receptor 2A
Synonyms:
5-HT-2A 5-HT2A 5-hydroxytryptamine receptor 2A (5HT2A) Htr2 Serotonin Receptor 2A
Type:
G Protein-Coupled Receptor (GPCR)
Mol. Mass.:
52852.05
Organism:
Rattus norvegicus (rat)
Description:
Rat cortex membranes 5-HT2A receptors.
Residue:
471
  
Inhibitor
Name:
BDBM50053188
Synonyms:
1-(2-{[5-Chloro-1-(4-fluoro-phenyl)-1H-indol-3-ylmethyl]-methyl-amino}-ethyl)-imidazolidin-2-one | CHEMBL122018
Type:
Small organic molecule
Emp. Form.:
C21H22ClFN4O
Mol. Mass.:
400.877
SMILES:
CN(CCN1CCNC1=O)Cc1cn(-c2ccc(F)cc2)c2ccc(Cl)cc12
: