Target
D(2) dopamine receptor
Ligand
BDBM50053188
Substrate
Meas. Tech.
ChEMBL_58553 (CHEMBL667488)
IC50
22±n/a nM
Citation
 Andersen, KLiljefors, THyttel, JPerregaard, J Serotonin 5-HT2 receptor, dopamine D2 receptor, and alpha 1 adrenoceptor antagonists. Conformationally flexible analogues of the atypical antipsychotic sertindole. J Med Chem 39:3723-38 (1996)  
Target
Name:
D(2) dopamine receptor
Synonyms:
DOPAMINE D2 DOPAMINE D2 Short Dopamine D2 receptor Drd2
Type:
G Protein-Coupled Receptor (GPCR)
Mol. Mass.:
50931.60
Organism:
Rattus norvegicus (rat)
Description:
P61169
Residue:
444
  
Inhibitor
Name:
BDBM50053188
Synonyms:
1-(2-{[5-Chloro-1-(4-fluoro-phenyl)-1H-indol-3-ylmethyl]-methyl-amino}-ethyl)-imidazolidin-2-one | CHEMBL122018
Type:
Small organic molecule
Emp. Form.:
C21H22ClFN4O
Mol. Mass.:
400.877
SMILES:
CN(CCN1CCNC1=O)Cc1cn(-c2ccc(F)cc2)c2ccc(Cl)cc12
: