Target
5-hydroxytryptamine receptor 1A
Ligand
BDBM50054718
Substrate
Meas. Tech.
ChEMBL_1061 (CHEMBL616386)
IC50
1.3±n/a nM
Citation
 Norman, MHNavas, FThompson, JBRigdon, GC Synthesis and evaluation of heterocyclic carboxamides as potential antipsychotic agents. J Med Chem 39:4692-703 (1997)  
Target
Name:
5-hydroxytryptamine receptor 1A
Synonyms:
5-HT1A 5-hydroxytryptamine receptor 1A (5HT1A) Gpcr18 Serotonin 1a (5-HT1a) receptor
Type:
Enzyme
Mol. Mass.:
46192.09
Organism:
Mus musculus (Mouse)
Description:
Q64264
Residue:
421
  
Inhibitor
Name:
BDBM50054718
Synonyms:
3-Amino-thiophene-2-carboxylic acid [4-(4-benzo[d]isothiazol-3-yl-piperazin-1-yl)-butyl]-amide | CHEMBL141438
Type:
Small organic molecule
Emp. Form.:
C20H25N5OS2
Mol. Mass.:
415.575
SMILES:
Nc1ccsc1C(=O)NCCCCN1CCN(CC1)c1nsc2ccccc12
: