Target
D(2) dopamine receptor
Ligand
BDBM50054708
Substrate
Meas. Tech.
ChEMBL_58195 (CHEMBL670363)
IC50
14±n/a nM
Citation
 Norman, MHNavas, FThompson, JBRigdon, GC Synthesis and evaluation of heterocyclic carboxamides as potential antipsychotic agents. J Med Chem 39:4692-703 (1997)  
Target
Name:
D(2) dopamine receptor
Synonyms:
DOPAMINE D2 Dopamine D2 receptor Drd2
Type:
Enzyme
Mol. Mass.:
50957.64
Organism:
Mus musculus (Mouse)
Description:
P61168
Residue:
444
  
Inhibitor
Name:
BDBM50054708
Synonyms:
1H-Indole-3-carboxylic acid [4-(4-benzo[d]isothiazol-3-yl-piperazin-1-yl)-butyl]-amide | CHEMBL142456
Type:
Small organic molecule
Emp. Form.:
C24H27N5OS
Mol. Mass.:
433.569
SMILES:
O=C(NCCCCN1CCN(CC1)c1nsc2ccccc12)c1c[nH]c2ccccc12
: