Target
Chymase
Ligand
BDBM50058994
Substrate
Meas. Tech.
ChEMBL_49438 (CHEMBL885061)
IC50
82±n/a nM
Citation
 Niwata, SFukami, HSumida, MIto, AKakutani, SSaitoh, MSuzuki, KImoto, MShibata, HImajo, SKiso, YTanaka, TNakazato, HIshihara, TTakai, SYamamoto, DShiota, NMiyazaki, MOkunishi, HKinoshita, AUrata, HArakawa, K Substituted 3-(phenylsulfonyl)-1-phenylimidazolidine-2,4-dione derivatives as novel nonpeptide inhibitors of human heart chymase. J Med Chem 40:2156-63 (1997)  
Target
Name:
Chymase
Synonyms:
Alpha-chymase CMA1_HUMAN CYM Mast cell protease I
Type:
Enzyme
Mol. Mass.:
27340.12
Organism:
Homo sapiens (Human)
Description:
Residue:
247
  
Inhibitor
Name:
BDBM50058994
Synonyms:
3-(2,5-Dioxo-3-phenyl-imidazolidine-1-sulfonyl)-benzoic acid methyl ester | CHEMBL304838
Type:
Small organic molecule
Emp. Form.:
C17H14N2O6S
Mol. Mass.:
374.368
SMILES:
COC(=O)c1cccc(c1)S(=O)(=O)N1C(=O)CN(C1=O)c1ccccc1
: