Target
Cholinesterase
Ligand
BDBM50241654
Substrate
Meas. Tech.
ChEMBL_1834121 (CHEMBL4334129)
IC50
>100000±n/a nM
Citation
 Hostalkova, AMarikova, JOpletal, LKorabecny, JHulcova, DKunes, JNovakova, LPerez, DIJun, DKucera, TAndrisano, VSiatka, TCahlikova, L Isoquinoline Alkaloids from Berberis vulgaris as Potential Lead Compounds for the Treatment of Alzheimer's Disease. J Nat Prod 82:239-248 (2019)  
Target
Name:
Cholinesterase
Synonyms:
Acylcholine acylhydrolase Butyrylcholine esterase (BChE) Butyrylcholinesterase (BuChE) CHLE_HUMAN Cholinesterases Pseudocholinesterase
Type:
Homotetramer
Mol. Mass.:
68422.27
Organism:
Homo sapiens (Human)
Description:
P06276
Residue:
602
  
Inhibitor
Name:
BDBM50241654
Synonyms:
(+)-berbamine CHEMBL504323
Type:
Small organic molecule
Emp. Form.:
C37H40N2O6
Mol. Mass.:
608.7233
SMILES:
COc1cc2CCN(C)[C@H]3Cc4ccc(Oc5cc(C[C@H]6N(C)CCc7cc(OC)c(OC)c(Oc1cc23)c67)ccc5O)cc4
: