Target
Chymotrypsin-like elastase family member 2A
Ligand
BDBM50061511
Substrate
Meas. Tech.
ChEMBL_156950 (CHEMBL762660)
IC50
70.0±n/a nM
Citation
 Ogilvie, WBailey, MPoupart, MAAbraham, ABhavsar, ABonneau, PBordeleau, JBousquet, YChabot, CDuceppe, JSFazal, GGoulet, SGrand-Maître, CGuse, IHalmos, TLavallée, PLeach, MMalenfant, EO'Meara, JPlante, RPlouffe, CPoirier, MSoucy, FYoakim, CDéziel, R Peptidomimetic inhibitors of the human cytomegalovirus protease. J Med Chem 40:4113-35 (1998)  
Target
Name:
Chymotrypsin-like elastase family member 2A
Synonyms:
CEL2A_PIG ELA2 Elastase 2A Elastase-2A | Pancreatic elastase
Type:
PROTEIN
Mol. Mass.:
28705.23
Organism:
Sus scrofa
Description:
ChEMBL_156951
Residue:
269
  
Inhibitor
Name:
BDBM50061511
Synonyms:
(S)-2-[(S)-2-(3,3-Dimethyl-butyrylamino)-3,3-dimethyl-butyrylamino]-N*4*,N*4*-dimethyl-N*1*-[1-methyl-2-(4-methyl-benzooxazol-2-yl)-2-oxo-ethyl]-succinamide | CHEMBL133638
Type:
Small organic molecule
Emp. Form.:
C29H43N5O6
Mol. Mass.:
557.6816
SMILES:
CC(NC(=O)[C@H](CC(=O)N(C)C)NC(=O)[C@@H](NC(=O)CC(C)(C)C)C(C)(C)C)C(=O)c1nc2c(C)cccc2o1
: