Target
Mitogen-activated protein kinase 15
Ligand
BDBM50509367
Substrate
Meas. Tech.
ChEMBL_1838055 (CHEMBL4338188)
IC50
>10000±n/a nM
Citation
 Hansen, KØAndersen, JHBayer, APandey, SKLorentzen, MJørgensen, KBSydnes, MOGuttormsen, YBaumann, MKoch, UKlebl, BEickhoff, JHaug, BEIsaksson, JHansen, EH Kinase Chemodiversity from the Arctic: The Breitfussins. J Med Chem 62:10167-10181 (2019)  
Target
Name:
Mitogen-activated protein kinase 15
Synonyms:
ERK-8 ERK8 MAPK15 Mitogen-activated protein kinase 15
Type:
Serine/threonine-protein kinase
Mol. Mass.:
59850.14
Organism:
Homo sapiens (Human)
Description:
gi_95147356
Residue:
544
  
Inhibitor
Name:
BDBM50509367
Synonyms:
CHEMBL4476426
Type:
Small organic molecule
Emp. Form.:
C16H11Br2N3O2
Mol. Mass.:
437.085
SMILES:
COc1cc(Br)cc2[nH]cc(-c3cnc(o3)-c3cc(Br)c[nH]3)c12
: