Target
Chymotrypsinogen A
Ligand
BDBM50066332
Substrate
Meas. Tech.
ChEMBL_49753 (CHEMBL662085)
Ki
131000±n/a nM
Citation
 Tucker, TJBrady, SFLumma, WCLewis, SDGardell, SJNaylor-Olsen, AMYan, YSisko, JTStauffer, KJLucas, BJLynch, JJCook, JJStranieri, MTHolahan, MALyle, EABaskin, EPChen, IWDancheck, KBKrueger, JACooper, CMVacca, JP Design and synthesis of a series of potent and orally bioavailable noncovalent thrombin inhibitors that utilize nonbasic groups in the P1 position. J Med Chem 41:3210-9 (1998)  
Target
Name:
Chymotrypsinogen A
Synonyms:
Alpha-chymotrypsin Chymotrypsin A Chymotrypsin A chain B Chymotrypsinogen A | alpha-Chymotrypsin (α-Chymotrypsin)
Type:
Serine protease
Mol. Mass.:
25670.88
Organism:
Bos taurus (bovine)
Description:
Residue:
245
  
Inhibitor
Name:
BDBM50066332
Synonyms:
(S)-1-((R)-2-Amino-2-cyclohexyl-acetyl)-pyrrolidine-2-carboxylic acid 2-carbamoylmethoxy-5-chloro-benzylamide | CHEMBL108717
Type:
Small organic molecule
Emp. Form.:
C22H31ClN4O4
Mol. Mass.:
450.959
SMILES:
N[C@H](C1CCCCC1)C(=O)N1CCC[C@H]1C(=O)NCc1cc(Cl)ccc1OCC(N)=O
: