Target
Reverse transcriptase/RNaseH
Ligand
BDBM50066460
Substrate
Meas. Tech.
ChEMBL_195842 (CHEMBL799141)
IC50
51±n/a nM
Citation
 Bold, GFässler, ACapraro, HGCozens, RKlimkait, TLazdins, JMestan, JPoncioni, BRösel, JStover, DTintelnot-Blomley, MAcemoglu, FBeck, WBoss, EEschbach, MHürlimann, TMasso, ERoussel, SUcci-Stoll, KWyss, DLang, M New aza-dipeptide analogues as potent and orally absorbed HIV-1 protease inhibitors: candidates for clinical development. J Med Chem 41:3387-401 (1998)  
Target
Name:
Reverse transcriptase/RNaseH
Synonyms:
HIV-1 Reverse Transcriptase RNase H Reverse transcriptase/RNaseH
Type:
PROTEIN
Mol. Mass.:
65229.15
Organism:
Human immunodeficiency virus 1
Description:
ChEMBL_1473730
Residue:
566
  
Inhibitor
Name:
BDBM50066460
Synonyms:
((S)-1-{N'-Biphenyl-4-ylmethyl-N'-[(2S,3S)-2-hydroxy-3-((S)-2-methoxycarbonylamino-3-methyl-butyrylamino)-4-phenyl-butyl]-hydrazinocarbonyl}-2,2-dimethyl-propyl)-carbamic acid methyl ester | CHEMBL266007
Type:
Small organic molecule
Emp. Form.:
C38H51N5O7
Mol. Mass.:
689.8408
SMILES:
COC(=O)N[C@@H](C(C)C)C(=O)N[C@@H](Cc1ccccc1)[C@@H](O)CN(Cc1ccc(cc1)-c1ccccc1)NC(=O)[C@@H](NC(=O)OC)C(C)(C)C
: