Target
Similar to alpha-tubulin isoform 1
Ligand
BDBM50513145
Substrate
Meas. Tech.
ChEMBL_1852096 (CHEMBL4352720)
IC50
370±n/a nM
Citation
 Niu, HStrecker, TEGerberich, JLCampbell, JWSaha, DMondal, DHamel, EChaplin, DJMason, RPTrawick, MLPinney, KG Structure Guided Design, Synthesis, and Biological Evaluation of Novel Benzosuberene Analogues as Inhibitors of Tubulin Polymerization. J Med Chem 62:5594-5615 (2019)  
Target
Name:
Similar to alpha-tubulin isoform 1
Synonyms:
Similar to alpha-tubulin isoform 1
Type:
PROTEIN
Mol. Mass.:
10383.05
Organism:
Bos taurus
Description:
ChEMBL_104716
Residue:
99
  
Inhibitor
Name:
BDBM50513145
Synonyms:
CHEMBL4559526
Type:
Small organic molecule
Emp. Form.:
C21H21NO4
Mol. Mass.:
351.3957
SMILES:
COc1cc(cc(OC)c1OC)C1=CCCc2c1ccc(OC)c2C#N
: