Target
Histamine H3 receptor
Ligand
BDBM50069821
Substrate
Meas. Tech.
ChEBML_85846
Ki
>2000±n/a nM
Citation
 Shih, NYAslanian, RLupo, ATOrlando, SPiwinski, JJGreen, MJGanguly, AKWest, RTozzi, SKreutner, WHey, JA Trans-4-methyl-3-imidazoyl pyrrolidine as a potent, highly selective histamine H3 receptor agonist in vivo. Bioorg Med Chem Lett 8:243-8 (1999)  
Target
Name:
Histamine H3 receptor
Synonyms:
HISTAMINE H3 HRH3_CAVPO | Histamine H3 receptor
Type:
Enzyme Catalytic Domain
Mol. Mass.:
48753.61
Organism:
GUINEA PIG
Description:
HISTAMINE H3 HRH3 GUINEA PIG::Q9JI35
Residue:
445
  
Inhibitor
Name:
BDBM50069821
Synonyms:
4-((2R,3S)-2-Benzyl-pyrrolidin-3-yl)-1H-imidazole | CHEMBL312613
Type:
Small organic molecule
Emp. Form.:
C14H17N3
Mol. Mass.:
227.3049
SMILES:
C([C@H]1NCC[C@@H]1c1cnc[nH]1)c1ccccc1
: