Target
Dihydroorotate dehydrogenase (quinone), mitochondrial
Ligand
BDBM50069942
Substrate
Meas. Tech.
ChEBML_52889
Ki
>180±n/a nM
Citation
 Pitts, WJJetter, JWPinto, DJOrwat, MJBatt, DGSherk, SRPetraitis, JJJacobson, ICCopeland, RADowling, RLJaffee, BDGardner, TLJones, EAMagolda, RL Structure-activity relationships (SAR) of some tetracyclic heterocycles related to the immunosuppressive agent Brequinar Sodium. Bioorg Med Chem Lett 8:307-12 (1999)  
Target
Name:
Dihydroorotate dehydrogenase (quinone), mitochondrial
Synonyms:
DHODH Dihydroorotate dehydrogenase Dihydroorotate dehydrogenase, mitochondrial Dihydroorotate oxidase (DHODH) | PYRD_HUMAN
Type:
Enzyme
Mol. Mass.:
42881.33
Organism:
Homo sapiens (Human)
Description:
Q02127
Residue:
395
  
Inhibitor
Name:
BDBM50069942
Synonyms:
CHEMBL107417 | Sodium; 9-fluoro-3-thiazol-2-yl-5,6-dihydro-benzo[c]acridine-7-carboxylate
Type:
Small organic molecule
Emp. Form.:
C21H12FN2O2S
Mol. Mass.:
375.396
SMILES:
[O-]C(=O)c1c2CCc3cc(ccc3-c2nc2ccc(F)cc12)-c1nccs1
: