Target
Dihydroorotate dehydrogenase (quinone), mitochondrial
Ligand
BDBM50069955
Substrate
Meas. Tech.
ChEBML_52889
Ki
>1000±n/a nM
Citation
 Pitts, WJJetter, JWPinto, DJOrwat, MJBatt, DGSherk, SRPetraitis, JJJacobson, ICCopeland, RADowling, RLJaffee, BDGardner, TLJones, EAMagolda, RL Structure-activity relationships (SAR) of some tetracyclic heterocycles related to the immunosuppressive agent Brequinar Sodium. Bioorg Med Chem Lett 8:307-12 (1999)  
Target
Name:
Dihydroorotate dehydrogenase (quinone), mitochondrial
Synonyms:
DHODH Dihydroorotate dehydrogenase Dihydroorotate dehydrogenase, mitochondrial Dihydroorotate oxidase (DHODH) | PYRD_HUMAN
Type:
Enzyme
Mol. Mass.:
42881.33
Organism:
Homo sapiens (Human)
Description:
Q02127
Residue:
395
  
Inhibitor
Name:
BDBM50069955
Synonyms:
CHEMBL104712 | Sodium; 9-fluoro-2-phenyl-5,6-dihydro-benzo[c]acridine-7-carboxylate
Type:
Small organic molecule
Emp. Form.:
C24H15FNO2
Mol. Mass.:
368.3804
SMILES:
[O-]C(=O)c1c2CCc3ccc(cc3-c2nc2ccc(F)cc12)-c1ccccc1
: