Target
Dihydroorotate dehydrogenase (quinone), mitochondrial
Ligand
BDBM50069952
Substrate
Meas. Tech.
ChEBML_52889
Ki
139±n/a nM
Citation
 Pitts, WJJetter, JWPinto, DJOrwat, MJBatt, DGSherk, SRPetraitis, JJJacobson, ICCopeland, RADowling, RLJaffee, BDGardner, TLJones, EAMagolda, RL Structure-activity relationships (SAR) of some tetracyclic heterocycles related to the immunosuppressive agent Brequinar Sodium. Bioorg Med Chem Lett 8:307-12 (1999)  
Target
Name:
Dihydroorotate dehydrogenase (quinone), mitochondrial
Synonyms:
DHODH Dihydroorotate dehydrogenase Dihydroorotate dehydrogenase, mitochondrial Dihydroorotate oxidase (DHODH) | PYRD_HUMAN
Type:
Enzyme
Mol. Mass.:
42881.33
Organism:
Homo sapiens (Human)
Description:
Q02127
Residue:
395
  
Inhibitor
Name:
BDBM50069952
Synonyms:
CHEMBL108327 | Sodium; 9-fluoro-5,5-dioxo-3-phenyl-5,6-dihydro-5lambda*6*-thiochromeno[4,3-b]quinoline-7-carboxylate
Type:
Small organic molecule
Emp. Form.:
C23H13FNO4S
Mol. Mass.:
418.418
SMILES:
[O-]C(=O)c1c2CS(=O)(=O)c3cc(ccc3-c2nc2ccc(F)cc12)-c1ccccc1
: