Target
Dihydroorotate dehydrogenase (quinone), mitochondrial
Ligand
BDBM50069946
Substrate
Meas. Tech.
ChEBML_52889
Ki
135±n/a nM
Citation
 Pitts, WJJetter, JWPinto, DJOrwat, MJBatt, DGSherk, SRPetraitis, JJJacobson, ICCopeland, RADowling, RLJaffee, BDGardner, TLJones, EAMagolda, RL Structure-activity relationships (SAR) of some tetracyclic heterocycles related to the immunosuppressive agent Brequinar Sodium. Bioorg Med Chem Lett 8:307-12 (1999)  
Target
Name:
Dihydroorotate dehydrogenase (quinone), mitochondrial
Synonyms:
DHODH Dihydroorotate dehydrogenase Dihydroorotate dehydrogenase, mitochondrial Dihydroorotate oxidase (DHODH) | PYRD_HUMAN
Type:
Enzyme
Mol. Mass.:
42881.33
Organism:
Homo sapiens (Human)
Description:
Q02127
Residue:
395
  
Inhibitor
Name:
BDBM50069946
Synonyms:
CHEMBL108213 | Sodium; 9-fluoro-3-m-tolyl-5H-6-thia-12-aza-benzo[a]anthracene-7-carboxylate
Type:
Small organic molecule
Emp. Form.:
C24H15FNO2S
Mol. Mass.:
400.445
SMILES:
Cc1cccc(c1)-c1ccc-2c(CSc3c-2nc2ccc(F)cc2c3C([O-])=O)c1
: