Target
Dihydroorotate dehydrogenase (quinone), mitochondrial
Ligand
BDBM50069962
Substrate
Meas. Tech.
ChEBML_52889
Ki
>182±n/a nM
Citation
 Pitts, WJJetter, JWPinto, DJOrwat, MJBatt, DGSherk, SRPetraitis, JJJacobson, ICCopeland, RADowling, RLJaffee, BDGardner, TLJones, EAMagolda, RL Structure-activity relationships (SAR) of some tetracyclic heterocycles related to the immunosuppressive agent Brequinar Sodium. Bioorg Med Chem Lett 8:307-12 (1999)  
Target
Name:
Dihydroorotate dehydrogenase (quinone), mitochondrial
Synonyms:
DHODH Dihydroorotate dehydrogenase Dihydroorotate dehydrogenase, mitochondrial Dihydroorotate oxidase (DHODH) | PYRD_HUMAN
Type:
Enzyme
Mol. Mass.:
42881.33
Organism:
Homo sapiens (Human)
Description:
Q02127
Residue:
395
  
Inhibitor
Name:
BDBM50069962
Synonyms:
CHEMBL322855 | Sodium; 8-fluoro-2-phenyl-4,5-dihydro-1-thia-11-aza-cyclopenta[a]anthracene-6-carboxylate
Type:
Small organic molecule
Emp. Form.:
C22H13FNO2S
Mol. Mass.:
374.408
SMILES:
[O-]C(=O)c1c2CCc3cc(sc3-c2nc2ccc(F)cc12)-c1ccccc1
: