Target
Dihydroorotate dehydrogenase (quinone), mitochondrial
Ligand
BDBM50069973
Substrate
Meas. Tech.
ChEBML_52889
Ki
81±n/a nM
Citation
 Pitts, WJJetter, JWPinto, DJOrwat, MJBatt, DGSherk, SRPetraitis, JJJacobson, ICCopeland, RADowling, RLJaffee, BDGardner, TLJones, EAMagolda, RL Structure-activity relationships (SAR) of some tetracyclic heterocycles related to the immunosuppressive agent Brequinar Sodium. Bioorg Med Chem Lett 8:307-12 (1999)  
Target
Name:
Dihydroorotate dehydrogenase (quinone), mitochondrial
Synonyms:
DHODH Dihydroorotate dehydrogenase Dihydroorotate dehydrogenase, mitochondrial Dihydroorotate oxidase (DHODH) | PYRD_HUMAN
Type:
Enzyme
Mol. Mass.:
42881.33
Organism:
Homo sapiens (Human)
Description:
Q02127
Residue:
395
  
Inhibitor
Name:
BDBM50069973
Synonyms:
CHEMBL104167 | Sodium; 9-fluoro-3-m-tolyl-5,6-dihydro-benzo[b][1,7]phenanthroline-7-carboxylate
Type:
Small organic molecule
Emp. Form.:
C24H16FN2O2
Mol. Mass.:
383.395
SMILES:
Cc1cccc(c1)-c1ccc-2c(CCc3c-2nc2ccc(F)cc2c3C([O-])=O)n1
: