Target
Dihydroorotate dehydrogenase (quinone), mitochondrial
Ligand
BDBM50069945
Substrate
Meas. Tech.
ChEBML_52889
Ki
160±n/a nM
Citation
 Pitts, WJJetter, JWPinto, DJOrwat, MJBatt, DGSherk, SRPetraitis, JJJacobson, ICCopeland, RADowling, RLJaffee, BDGardner, TLJones, EAMagolda, RL Structure-activity relationships (SAR) of some tetracyclic heterocycles related to the immunosuppressive agent Brequinar Sodium. Bioorg Med Chem Lett 8:307-12 (1999)  
Target
Name:
Dihydroorotate dehydrogenase (quinone), mitochondrial
Synonyms:
DHODH Dihydroorotate dehydrogenase Dihydroorotate dehydrogenase, mitochondrial Dihydroorotate oxidase (DHODH) | PYRD_HUMAN
Type:
Enzyme
Mol. Mass.:
42881.33
Organism:
Homo sapiens (Human)
Description:
Q02127
Residue:
395
  
Inhibitor
Name:
BDBM50069945
Synonyms:
CHEMBL106529 | Sodium; 9-fluoro-3-(3-methoxy-phenyl)-5,6-dihydro-benzo[b][1,7]phenanthroline-7-carboxylate
Type:
Small organic molecule
Emp. Form.:
C24H16FN2O3
Mol. Mass.:
399.3944
SMILES:
COc1cccc(c1)-c1ccc-2c(CCc3c-2nc2ccc(F)cc2c3C([O-])=O)n1
: