Target
Dihydroorotate dehydrogenase (quinone), mitochondrial
Ligand
BDBM50069974
Substrate
Meas. Tech.
ChEBML_52889
Ki
380±n/a nM
Citation
 Pitts, WJJetter, JWPinto, DJOrwat, MJBatt, DGSherk, SRPetraitis, JJJacobson, ICCopeland, RADowling, RLJaffee, BDGardner, TLJones, EAMagolda, RL Structure-activity relationships (SAR) of some tetracyclic heterocycles related to the immunosuppressive agent Brequinar Sodium. Bioorg Med Chem Lett 8:307-12 (1999)  
Target
Name:
Dihydroorotate dehydrogenase (quinone), mitochondrial
Synonyms:
DHODH Dihydroorotate dehydrogenase Dihydroorotate dehydrogenase, mitochondrial Dihydroorotate oxidase (DHODH) | PYRD_HUMAN
Type:
Enzyme
Mol. Mass.:
42881.33
Organism:
Homo sapiens (Human)
Description:
Q02127
Residue:
395
  
Inhibitor
Name:
BDBM50069974
Synonyms:
CHEMBL322100 | Sodium; 9-fluoro-3-phenyl-5,6-dihydro-2,4,12-triaza-benzo[a]anthracene-7-carboxylate
Type:
Small organic molecule
Emp. Form.:
C22H13FN3O2
Mol. Mass.:
370.3565
SMILES:
[O-]C(=O)c1c2CCc3nc(ncc3-c2nc2ccc(F)cc12)-c1ccccc1
: