Target
Free fatty acid receptor 1
Ligand
BDBM50392863
Substrate
Meas. Tech.
ChEMBL_1887214 (CHEMBL4388891)
EC50
79±n/a nM
Citation
 Pio, BChobanian, HRGuo, YJosien, HHagmann, WKMiller, MTrujillo, MEKirkland, MKosinski, DMane, JPachanski, MCheewatrakoolpong, BAshley, EOrr, RWright, MJBugianesi, RSouza, SZhang, XDi Salvo, JWeinglass, ABTschirret-Guth, RSamuel, KChen, QShang, JLamca, JEhrhart, JNargund, RHoward, ADColletti, SL Design, synthesis and biological evaluation of indane derived GPR40 agoPAMs. Bioorg Med Chem Lett 29:1842-1848 (2019)  
Target
Name:
Free fatty acid receptor 1
Synonyms:
FFAR1 G-protein Coupled Receptor 40 | GPR40
Type:
G Protein-Coupled Receptor (GPCR)
Mol. Mass.:
31473.32
Organism:
Homo sapiens (Human)
Description:
O14842
Residue:
300
  
Inhibitor
Name:
BDBM50392863
Synonyms:
CHEMBL2152069
Type:
Small organic molecule
Emp. Form.:
C26H25FO4
Mol. Mass.:
420.4727
SMILES:
COc1ccc(F)c(c1)-c1ccc(COc2cccc(c2)[C@@H](CC(O)=O)C2CC2)cc1
: