Target
Cyclin-dependent kinase 1
Ligand
BDBM7263
Substrate
Meas. Tech.
ChEMBL_50351 (CHEMBL662511)
IC50
24±n/a nM
Citation
 Schultz, CLink, ALeost, MZaharevitz, DWGussio, RSausville, EAMeijer, LKunick, C Paullones, a series of cyclin-dependent kinase inhibitors: synthesis, evaluation of CDK1/cyclin B inhibition, and in vitro antitumor activity. J Med Chem 42:2909-19 (1999)  
Target
Name:
Cyclin-dependent kinase 1
Synonyms:
CDC2 CDK1 CDKN1 Cell division protein kinase 1 P34CDC2 | p34 protein kinase
Type:
Enzyme Subunit
Mol. Mass.:
34101.08
Organism:
Homo sapiens (Human)
Description:
P06493
Residue:
297
  
Inhibitor
Name:
BDBM7263
Synonyms:
9-cyanopaullone CHEMBL299756 Paullone Analog 2
Type:
Small organic molecule
Emp. Form.:
C17H11N3O
Mol. Mass.:
273.2887
SMILES:
O=C1Cc2c([nH]c3ccc(cc23)C#N)-c2ccccc2N1
: