Target
Cyclin-dependent kinase 1
Ligand
BDBM7298
Substrate
Meas. Tech.
ChEMBL_50351 (CHEMBL662511)
IC50
240±n/a nM
Citation
 Schultz, CLink, ALeost, MZaharevitz, DWGussio, RSausville, EAMeijer, LKunick, C Paullones, a series of cyclin-dependent kinase inhibitors: synthesis, evaluation of CDK1/cyclin B inhibition, and in vitro antitumor activity. J Med Chem 42:2909-19 (1999)  
Target
Name:
Cyclin-dependent kinase 1
Synonyms:
CDC2 CDK1 CDKN1 Cell division protein kinase 1 P34CDC2 | p34 protein kinase
Type:
Enzyme Subunit
Mol. Mass.:
34101.08
Organism:
Homo sapiens (Human)
Description:
P06493
Residue:
297
  
Inhibitor
Name:
BDBM7298
Synonyms:
2-bromo-9-trifluoromethylpaullone CHEMBL100309 Paullone Analog 37
Type:
Small organic molecule
Emp. Form.:
C17H10BrF3N2O
Mol. Mass.:
395.173
SMILES:
FC(F)(F)c1ccc2[nH]c-3c(CC(=O)Nc4ccc(Br)cc-34)c2c1
: