Target
Cyclin-dependent kinase 1
Ligand
BDBM7273
Substrate
Meas. Tech.
ChEMBL_50351 (CHEMBL662511)
IC50
200±n/a nM
Citation
 Schultz, CLink, ALeost, MZaharevitz, DWGussio, RSausville, EAMeijer, LKunick, C Paullones, a series of cyclin-dependent kinase inhibitors: synthesis, evaluation of CDK1/cyclin B inhibition, and in vitro antitumor activity. J Med Chem 42:2909-19 (1999)  
Target
Name:
Cyclin-dependent kinase 1
Synonyms:
CDC2 CDK1 CDKN1 Cell division protein kinase 1 P34CDC2 | p34 protein kinase
Type:
Enzyme Subunit
Mol. Mass.:
34101.08
Organism:
Homo sapiens (Human)
Description:
P06493
Residue:
297
  
Inhibitor
Name:
BDBM7273
Synonyms:
14-bromo-4,5-dimethoxy-8,18-diazatetracyclo[9.7.0.0^{2,7}.0^{12,17}]octadeca-1(11),2,4,6,12(17),13,15-heptaen-9-one CHEMBL319373 Paullone Analog 12
Type:
Small organic molecule
Emp. Form.:
C18H15BrN2O3
Mol. Mass.:
387.227
SMILES:
COc1cc2NC(=O)Cc3c([nH]c4ccc(Br)cc34)-c2cc1OC
: