Target
Adenosine kinase
Ligand
BDBM50524386
Substrate
Meas. Tech.
ChEMBL_1892980 (CHEMBL4394901)
Ki
>50000±n/a nM
Citation
 Crespo, RADang, QZhou, NEGuthrie, LMSnavely, TCDong, WLoesch, KASuzuki, TYou, LWang, WO'Malley, TParish, TOlsen, DBSacchettini, JC Structure-Guided Drug Design of 6-Substituted Adenosine Analogues as Potent Inhibitors of Mycobacterium tuberculosis Adenosine Kinase. J Med Chem 62:4483-4499 (2019)  
Target
Name:
Adenosine kinase
Synonyms:
ADK | ADK_HUMAN
Type:
PROTEIN
Mol. Mass.:
40545.97
Organism:
Homo sapiens (Human)
Description:
ChEMBL_1467841
Residue:
362
  
Inhibitor
Name:
BDBM50524386
Synonyms:
CHEMBL4474951
Type:
Small organic molecule
Emp. Form.:
C24H20N4O4
Mol. Mass.:
428.44
SMILES:
OC[C@H]1O[C@H]([C@H](O)[C@@H]1O)n1cnc2c(ncnc12)C#Cc1ccc(cc1)-c1ccccc1
: