Target
Phosphatidylcholine:ceramide cholinephosphotransferase 1
Ligand
BDBM50182487
Substrate
Meas. Tech.
ChEMBL_1897470 (CHEMBL4399505)
IC50
4000±n/a nM
Citation
 Othman, MAYuyama, KMurai, YIgarashi, YMikami, DSivasothy, YAwang, KMonde, K Malabaricone C as Natural Sphingomyelin Synthase Inhibitor against Diet-Induced Obesity and Its Lipid Metabolism in Mice. ACS Med Chem Lett 10:1154-1158 (2019)  
Target
Name:
Phosphatidylcholine:ceramide cholinephosphotransferase 1
Synonyms:
MOB Protein Mob SMS1 Sphingomyelin synthase 1 Transmembrane protein 23
Type:
PROTEIN
Mol. Mass.:
48630.99
Organism:
Homo sapiens (Human)
Description:
ChEMBL_109868
Residue:
413
  
Inhibitor
Name:
BDBM50182487
Synonyms:
Malabaricone A
Type:
Small organic molecule
Emp. Form.:
C21H26O3
Mol. Mass.:
326.4293
SMILES:
Oc1cccc(O)c1C(=O)CCCCCCCCc1ccccc1
: