Target
Phosphatidylcholine:ceramide cholinephosphotransferase 1
Ligand
BDBM50182486
Substrate
Meas. Tech.
ChEMBL_1897472 (CHEMBL4399507)
IC50
2000±n/a nM
Citation
 Othman, MAYuyama, KMurai, YIgarashi, YMikami, DSivasothy, YAwang, KMonde, K Malabaricone C as Natural Sphingomyelin Synthase Inhibitor against Diet-Induced Obesity and Its Lipid Metabolism in Mice. ACS Med Chem Lett 10:1154-1158 (2019)  
Target
Name:
Phosphatidylcholine:ceramide cholinephosphotransferase 1
Synonyms:
MOB Protein Mob SMS1 Sphingomyelin synthase 1 Transmembrane protein 23
Type:
PROTEIN
Mol. Mass.:
48630.99
Organism:
Homo sapiens (Human)
Description:
ChEMBL_109868
Residue:
413
  
Inhibitor
Name:
BDBM50182486
Synonyms:
MALABARICONE B
Type:
Small organic molecule
Emp. Form.:
C21H26O4
Mol. Mass.:
342.4287
SMILES:
Oc1ccc(CCCCCCCCC(=O)c2c(O)cccc2O)cc1
: