Target
Peroxisome proliferator-activated receptor gamma
Ligand
BDBM50081224
Substrate
Meas. Tech.
ChEMBL_154533 (CHEMBL760254)
EC50
1000±n/a nM
Citation
 Brown, PJWinegar, DAPlunket, KDMoore, LBLewis, MCWilson, JGSundseth, SSKoble, CSWu, ZChapman, JMLehmann, JMKliewer, SAWillson, TM A ureido-thioisobutyric acid (GW9578) is a subtype-selective PPARalpha agonist with potent lipid-lowering activity. J Med Chem 42:3785-8 (1999)  
Target
Name:
Peroxisome proliferator-activated receptor gamma
Synonyms:
Nr1c3 PPAR-gamma Pparg
Type:
PROTEIN
Mol. Mass.:
57593.55
Organism:
Mus musculus
Description:
ChEMBL_1453700
Residue:
505
  
Inhibitor
Name:
BDBM50081224
Synonyms:
2-(4-{2-[1-(5-Cyclohexyl-pentyl)-3-(4-fluoro-phenyl)-ureido]-ethyl}-phenoxy)-2-methyl-propionic acid | CHEMBL125230
Type:
Small organic molecule
Emp. Form.:
C30H41FN2O4
Mol. Mass.:
512.6559
SMILES:
CC(C)(Oc1ccc(CCN(CCCCCC2CCCCC2)C(=O)Nc2ccc(F)cc2)cc1)C(O)=O
: