Target
Serine protease 1
Ligand
BDBM50088653
Substrate
Meas. Tech.
ChEMBL_213208 (CHEMBL818021)
Ki
420±n/a nM
Citation
 Coburn, CARush, DMWilliams, PDHomnick, CLyle, EALewis, SDLucas, BJDi Muzio-Mower, JMJuliano, MKrueger, JAVastag, KChen, IWVacca, JP Bicyclic pyridones as potent, efficacious and orally bioavailable thrombin inhibitors. Bioorg Med Chem Lett 10:1069-72 (2000)  
Target
Name:
Serine protease 1
Synonyms:
Alpha-trypsin chain 1 Beta-trypsin PRSS1 TRP1 TRY1_HUMAN Thrombin & trypsin Trypsin I | Trypsin-1
Type:
Enzyme
Mol. Mass.:
26557.80
Organism:
Homo sapiens (Human)
Description:
P07477
Residue:
247
  
Inhibitor
Name:
BDBM50088653
Synonyms:
CHEMBL274152 | N-(6-Amino-2-methyl-pyridin-3-ylmethyl)-2-((R)-3-cyclobutylmethyl-6-methyl-2,8-dioxo-2,3,4,8-tetrahydro-1H-[1,7]naphthyridin-7-yl)-acetamide
Type:
Small organic molecule
Emp. Form.:
C23H29N5O3
Mol. Mass.:
423.5081
SMILES:
Cc1cc2C[C@@H](CC3CCC3)C(=O)Nc2c(=O)n1CC(=O)NCc1ccc(N)nc1C
: