Target
Chitin synthase 1
Ligand
BDBM50089543
Substrate
Meas. Tech.
ChEBML_49240
IC50
2.8±n/a nM
Citation
 Masubuchi, KTaniguchi, MUmeda, IHattori, KSuda, HKohchi, YIsshiki, YSakai, TKohchi, MShirai, MOkabe, HSudoh, MYamazaki, TShimma, N Synthesis and structure-activity relationships of novel fungal chitin synthase inhibitors. Bioorg Med Chem Lett 10:1459-62 (2000)  
Target
Name:
Chitin synthase 1
Synonyms:
CHS1 Chitin synthase | Chitin synthase 1
Type:
PROTEIN
Mol. Mass.:
88249.31
Organism:
Candida albicans
Description:
ChEMBL_49240
Residue:
776
  
Inhibitor
Name:
BDBM50089543
Synonyms:
5-[((E)-6,6-Dimethyl-hept-2-en-4-ynyl)-methyl-amino]-3,4-dihydro-1H-quinolin-2-one | CHEMBL35760
Type:
Small organic molecule
Emp. Form.:
C19H24N2O
Mol. Mass.:
296.4067
SMILES:
CN(C\C=C\C#CC(C)(C)C)c1cccc2NC(=O)CCc12
: