Target
Chitin synthase 1
Ligand
BDBM50089546
Substrate
Meas. Tech.
ChEMBL_49240 (CHEMBL660661)
IC50
71±n/a nM
Citation
 Masubuchi, KTaniguchi, MUmeda, IHattori, KSuda, HKohchi, YIsshiki, YSakai, TKohchi, MShirai, MOkabe, HSudoh, MYamazaki, TShimma, N Synthesis and structure-activity relationships of novel fungal chitin synthase inhibitors. Bioorg Med Chem Lett 10:1459-62 (2000)  
Target
Name:
Chitin synthase 1
Synonyms:
CHS1 Chitin synthase | Chitin synthase 1
Type:
PROTEIN
Mol. Mass.:
88249.31
Organism:
Candida albicans
Description:
ChEMBL_49240
Residue:
776
  
Inhibitor
Name:
BDBM50089546
Synonyms:
5-((E)-6,6-Dimethyl-hept-2-en-4-ynylamino)-1H-quinolin-2-one | CHEMBL265094
Type:
Small organic molecule
Emp. Form.:
C18H20N2O
Mol. Mass.:
280.3642
SMILES:
CC(C)(C)C#C\C=C\CNc1cccc2[nH]c(=O)ccc12
: