Target
Chitin synthase 1
Ligand
BDBM50089554
Substrate
Meas. Tech.
ChEBML_49240
IC50
1000±n/a nM
Citation
 Masubuchi, KTaniguchi, MUmeda, IHattori, KSuda, HKohchi, YIsshiki, YSakai, TKohchi, MShirai, MOkabe, HSudoh, MYamazaki, TShimma, N Synthesis and structure-activity relationships of novel fungal chitin synthase inhibitors. Bioorg Med Chem Lett 10:1459-62 (2000)  
Target
Name:
Chitin synthase 1
Synonyms:
CHS1 Chitin synthase | Chitin synthase 1
Type:
PROTEIN
Mol. Mass.:
88249.31
Organism:
Candida albicans
Description:
ChEMBL_49240
Residue:
776
  
Inhibitor
Name:
BDBM50089554
Synonyms:
CHEMBL35365 | N-[3-((E)-6,6-Dimethyl-hept-2-en-4-ynylamino)-phenyl]-acetamide
Type:
Small organic molecule
Emp. Form.:
C17H22N2O
Mol. Mass.:
270.3694
SMILES:
CC(=O)Nc1cccc(NC\C=C\C#CC(C)(C)C)c1
: