Target
Coagulation factor X
Ligand
BDBM50090614
Substrate
Meas. Tech.
ChEBML_48997
Ki
>1200±n/a nM
Citation
 He, WHanney, BMyers, MRSpada, APBrown, KColussi, DChu, V Nonbenzamidine compounds as selective factor Xa inhibitors. Bioorg Med Chem Lett 10:1737-9 (2000)  
Target
Name:
Coagulation factor X
Synonyms:
Activated coagulation factor X (FXa) Coagulation factor X precursor F10 Factor X heavy chain Factor Xa Stuart-Prower factor
Type:
Enzyme
Mol. Mass.:
54726.60
Organism:
Homo sapiens (Human)
Description:
Residue:
488
  
Inhibitor
Name:
BDBM50090614
Synonyms:
2-[4-(6-Chloro-benzo[b]thiophene-2-sulfonyl)-2-oxo-piperazin-1-yl]-N-(2-imidazol-1-yl-ethyl)-acetamide | CHEMBL297152
Type:
Small organic molecule
Emp. Form.:
C19H20ClN5O4S2
Mol. Mass.:
481.976
SMILES:
Clc1ccc2cc(sc2c1)S(=O)(=O)N1CCN(CC(=O)NCCn2ccnc2)C(=O)C1
: