Target
Tissue-type plasminogen activator
Ligand
BDBM50090593
Substrate
Meas. Tech.
ChEBML_225384
Ki
>8700±n/a nM
Citation
 He, WHanney, BMyers, MRSpada, APBrown, KColussi, DChu, V Nonbenzamidine compounds as selective factor Xa inhibitors. Bioorg Med Chem Lett 10:1737-9 (2000)  
Target
Name:
Tissue-type plasminogen activator
Synonyms:
Alteplase Reteplase Thrombin receptor protein Tissue-type plasminogen activator (tPA) t-PA t-plasminogen activator
Type:
Enzyme
Mol. Mass.:
62931.08
Organism:
Homo sapiens (Human)
Description:
Residue:
562
  
Inhibitor
Name:
BDBM50090593
Synonyms:
2-[4-(6-Chloro-benzo[b]thiophene-2-sulfonyl)-2-oxo-piperazin-1-yl]-N-[2-(3-methyl-3H-imidazol-4-yl)-ethyl]-acetamide | CHEMBL48236
Type:
Small organic molecule
Emp. Form.:
C20H22ClN5O4S2
Mol. Mass.:
496.003
SMILES:
Cn1cncc1CCNC(=O)CN1CCN(CC1=O)S(=O)(=O)c1cc2ccc(Cl)cc2s1
: