Target
5-hydroxytryptamine receptor 1A
Ligand
BDBM50090757
Substrate
Meas. Tech.
ChEMBL_1206 (CHEMBL615972)
Ki
397.0±n/a nM
Citation
 Hammarberg, ENordvall, GLeideborg, RNylöf, MHanson, SJohansson, LThorberg, SOTolf, BRJerning, ESvantesson, GTMohell, NAhlgren, CWestlind-Danielsson, ACsöregh, IJohansson, R Synthesis of novel 5-substituted 3-amino-3,4-dihydro-2H-1-benzopyran derivatives and their interactions with the 5-HT1A receptor. J Med Chem 43:2837-50 (2000)  
Target
Name:
5-hydroxytryptamine receptor 1A
Synonyms:
5-HT-1A 5-HT1A 5-hydroxytryptamine receptor 1A (5HT1A) 5ht1a Htr1a Serotonin 1a (5-HT1a) receptor/Adrenergic receptor alpha-1 | Serotonin receptor 1A
Type:
G Protein-Coupled Receptor (GPCR)
Mol. Mass.:
46445.29
Organism:
Rattus norvegicus (rat)
Description:
Binding assays were performed using rat hippocampal membranes.
Residue:
422
  
Inhibitor
Name:
BDBM50090757
Synonyms:
(R)-3-Isopropylamino-chroman-5-carboxylic acid amide | CHEMBL319403
Type:
Small organic molecule
Emp. Form.:
C13H18N2O2
Mol. Mass.:
234.2942
SMILES:
CC(C)NC1COc2cccc(C(N)=O)c2C1
: