Target
Nitric oxide synthase, inducible
Ligand
BDBM50091808
Substrate
Meas. Tech.
ChEBML_89191
IC50
600±n/a nM
Citation
 Hagmann, WKCaldwell, CGChen, PDurette, PLEsser, CKLanza, TJKopka, IEGuthikonda, RShah, SKMacCoss, MChabin, RMFletcher, DGrant, SKGreen, BGHumes, JLKelly, TMLuell, SMeurer, RMoore, VPacholok, SGPavia, TWilliams, HRWong, KK Substituted 2-aminopyridines as inhibitors of nitric oxide synthases. Bioorg Med Chem Lett 10:1975-8 (2001)  
Target
Name:
Nitric oxide synthase, inducible
Synonyms:
HEP-NOS Inducible NO synthase NOS type II NOS2A Nitric oxide synthase, inducible (iNOS) | iNOS
Type:
Homodimer
Mol. Mass.:
131141.95
Organism:
Homo sapiens (Human)
Description:
P35228
Residue:
1153
  
Inhibitor
Name:
BDBM50091808
Synonyms:
5-METHYLPYRIDIN-2-AMINE CHEMBL61990
Type:
Small organic molecule
Emp. Form.:
C6H8N2
Mol. Mass.:
108.1411
SMILES:
Cc1ccc(N)nc1
: