Target
Tyrosine-protein kinase SYK
Ligand
BDBM50538454
Substrate
Meas. Tech.
ChEMBL_1972858 (CHEMBL4605676)
EC50
29±n/a nM
Citation
 Blomgren, PChandrasekhar, JDi Paolo, JAFung, WGeng, GIp, CJones, RKropf, JELansdon, EBLee, SLo, JRMitchell, SAMurray, BPohlmeyer, CSchmitt, ASuekawa-Pirrone, KWise, SXiong, JMXu, JYu, HZhao, ZCurrie, KS Discovery of Lanraplenib (GS-9876): A Once-Daily Spleen Tyrosine Kinase Inhibitor for Autoimmune Diseases. ACS Med Chem Lett 11:506-513 (2020)  
Target
Name:
Tyrosine-protein kinase SYK
Synonyms:
KSYK_HUMAN Spleen Tyrosine Kinase Tyrosine-protein kinase SYK (Syk)
Type:
Enzyme
Mol. Mass.:
72079.99
Organism:
Homo sapiens (Human)
Description:
P43405
Residue:
635
  
Inhibitor
Name:
BDBM50538454
Synonyms:
CHEMBL4643354
Type:
Small organic molecule
Emp. Form.:
C24H23N7O2
Mol. Mass.:
441.4851
SMILES:
OC[C@H]1CN(CCO1)c1ccc(Nc2nc(cn3ccnc23)-c2ccc3cn[nH]c3c2)cc1
: