Target
NAD-dependent protein deacetylase sirtuin-1
Ligand
BDBM50540050
Substrate
Meas. Tech.
ChEMBL_1980070 (CHEMBL4613332)
EC50
650±n/a nM
Citation
 Wang, YHe, JLiao, MHu, MLi, WOuyang, HWang, XYe, TZhang, YOuyang, L An overview of Sirtuins as potential therapeutic target: Structure, function and modulators. Eur J Med Chem 161:48-77 (2019)  
Target
Name:
NAD-dependent protein deacetylase sirtuin-1
Synonyms:
NAD-Dependent Deacetylase Sirtuin-1 NAD-dependent protein deacetylase sirtuin-1 (SIRT1) SIR2-like protein 1 SIRT1 Sirtuin-1 (SIRT1) | hSIR2
Type:
Developmental protein; hydrolase
Mol. Mass.:
81626.66
Organism:
Homo sapiens (Human)
Description:
Residue:
747
  
Inhibitor
Name:
BDBM50540050
Synonyms:
CHEMBL4646804
Type:
Small organic molecule
Emp. Form.:
C23H26F2N4O4S
Mol. Mass.:
492.539
SMILES:
Cn1nc(C(=O)N[C@H]2CC[C@H](O)CC2)c2cc(NCc3cc(F)c(F)cc3S(C)(=O)=O)ccc12
: