Target
Cathepsin K
Ligand
BDBM50096396
Substrate
Meas. Tech.
ChEBML_216707
Ki
15±n/a nM
Citation
 Fenwick, AEGribble, ADIfe, RJStevens, NWitherington, J Diastereoselective synthesis, activity and chiral stability of cyclic alkoxyketone inhibitors of cathepsin K. Bioorg Med Chem Lett 11:199-202 (2001)  
Target
Name:
Cathepsin K
Synonyms:
CATK_HUMAN CTSO Cathepsin O Cathepsin X
Type:
Enzyme
Mol. Mass.:
36975.68
Organism:
Homo sapiens (Human)
Description:
P43235
Residue:
329
  
Inhibitor
Name:
BDBM50096396
Synonyms:
CHEMBL292937 | Quinoline-2-carboxylic acid [(S)-3-methyl-1-((S)-4-oxo-tetrahydro-furan-3-ylcarbamoyl)-butyl]-amide
Type:
Small organic molecule
Emp. Form.:
C20H23N3O4
Mol. Mass.:
369.4143
SMILES:
CC(C)C[C@H](NC(=O)c1ccc2ccccc2n1)C(=O)N[C@H]1COCC1=O
: