Target
Integrin alpha-L/Integrin beta-2/Intercellular adhesion molecule 1
Ligand
BDBM50099142
Substrate
Meas. Tech.
ChEMBL_96794 (CHEMBL703271)
IC50
15±n/a nM
Citation
 Link, JTSorensen, BLiu, GPei, ZReilly, EBLeitza, SOkasinski, G Discovery and SAR of diarylsulfide cyclopropylamide LFA-1/ICAM-1 interaction antagonists. Bioorg Med Chem Lett 11:973-6 (2001)  
Target
Name:
Integrin alpha-L/Integrin beta-2/Intercellular adhesion molecule 1
Synonyms:
Integrin beta-2/Intercellular adhesion molecule-1 /Leukocyte adhesion glycoprotein LFA-1 alpha | Intercellular adhesion molecule (ICAM-1), Integrin alpha-L/beta-2
Type:
Mol. Mass.:
Description:
ASSAY_ID of EBI is 97281
Components:
This complex has 3 components.
Component 1
Name:
Integrin alpha-L
Synonyms:
CD11 antigen-like family member A CD_antigen=CD11a ITGAL LFA-1A Leukocyte adhesion glycoprotein LFA-1 alpha chain | Leukocyte function-associated molecule 1 alpha chain
Type:
PROTEIN
Mol. Mass.:
128748.90
Organism:
Homo sapiens (Human)
Description:
ChEMBL_629045
Residue:
1170
  
Component 2
Name:
Intercellular adhesion molecule 1
Synonyms:
CD_antigen=CD54 ICAM1 Intercellular adhesion molecule (ICAM-1), Integrin alpha-L/beta-2 Intercellular adhesion molecule-1 | Major group rhinovirus receptor
Type:
PROTEIN
Mol. Mass.:
57831.10
Organism:
Homo sapiens (Human)
Description:
ChEMBL_826675
Residue:
532
  
Component 3
Name:
Integrin beta-2
Synonyms:
CD18 ITGB2 MFI7
Type:
PROTEIN
Mol. Mass.:
84785.60
Organism:
Homo sapiens (Human)
Description:
EBI_12662
Residue:
769
  
Inhibitor
Name:
BDBM50099142
Synonyms:
2-[4-(2-Morpholin-4-yl-phenylsulfanyl)-3-trifluoromethyl-phenyl]-cyclopropanecarboxylic acid [3-(2-oxo-pyrrolidin-1-yl)-propyl]-amide | CHEMBL368143
Type:
Small organic molecule
Emp. Form.:
C28H32F3N3O3S
Mol. Mass.:
547.632
SMILES:
FC(F)(F)c1cc(ccc1Sc1ccccc1N1CCOCC1)C1CC1C(=O)NCCCN1CCCC1=O
: