Target
Carbonyl reductase [NADPH] 1
Ligand
BDBM50543401
Substrate
Meas. Tech.
ChEMBL_1989079 (CHEMBL4622626)
IC50
440±n/a nM
Citation
 Endo, SOguri, HSegawa, JKawai, MHu, DXia, SOkada, TIrie, KFujii, SGouda, HIguchi, KMatsukawa, TFujimoto, NNakayama, TToyooka, NMatsunaga, TIkari, A Development of Novel AKR1C3 Inhibitors as New Potential Treatment for Castration-Resistant Prostate Cancer. J Med Chem 63:10396-10411 (2020)  
Target
Name:
Carbonyl reductase [NADPH] 1
Synonyms:
CBR CBR1_HUMAN SDR21C1
Type:
PROTEIN
Mol. Mass.:
30380.63
Organism:
Homo sapiens (Human)
Description:
ChEMBL_607770
Residue:
277
  
Inhibitor
Name:
BDBM50543401
Synonyms:
CHEMBL4644092
Type:
Small organic molecule
Emp. Form.:
C16H11FN2O3
Mol. Mass.:
298.2685
SMILES:
Oc1cccc2cc(C(=O)Nc3ccc(F)cc3)c(=N)oc12
: