Target
Muscarinic acetylcholine receptor M2
Ligand
BDBM50103079
Substrate
Meas. Tech.
ChEBML_138180
Ki
270±n/a nM
Citation
 Tagat, JRMcCombie, SWSteensma, RWLin, SNazareno, DVBaroudy, BVantuno, NXu, SLiu, J Piperazine-based CCR5 antagonists as HIV-1 inhibitors. I: 2(S)-methyl piperazine as a key pharmacophore element. Bioorg Med Chem Lett 11:2143-6 (2001)  
Target
Name:
Muscarinic acetylcholine receptor M2
Synonyms:
ACM2_HUMAN Cholinergic, muscarinic M2 Muscarinic acetylcholine receptor M2 and M5 | RecName: Full=Muscarinic acetylcholine receptor M2
Type:
GPCR
Mol. Mass.:
51730.61
Organism:
Homo sapiens (Human)
Description:
P08172
Residue:
466
  
Inhibitor
Name:
BDBM50103079
Synonyms:
CHEMBL303503 | [4-((S)-4-{(S)-1-[4-(Benzo[1,3]dioxole-5-sulfonyl)-phenyl]-ethyl}-3-methyl-piperazin-1-yl)-piperidin-1-yl]-(2,6-dichloro-phenyl)-methanone
Type:
Small organic molecule
Emp. Form.:
C32H35Cl2N3O5S
Mol. Mass.:
644.608
SMILES:
C[C@H](N1CCN(C[C@@H]1C)C1CCN(CC1)C(=O)c1c(Cl)cccc1Cl)c1ccc(cc1)S(=O)(=O)c1ccc2OCOc2c1
: