Target
5-hydroxytryptamine receptor 2C
Ligand
BDBM50091438
Substrate
Meas. Tech.
ChEMBL_3051 (CHEMBL620669)
Ki
79±n/a nM
Citation
 Witherington, JBordas, VCooper, DGForbes, ITGribble, ADIfe, RJBerkhout, TGohil, JGroot, PH Conformationally restricted indolopiperidine derivatives as potent CCR2B receptor antagonists. Bioorg Med Chem Lett 11:2177-80 (2001)  
Target
Name:
5-hydroxytryptamine receptor 2C
Synonyms:
5-HT-1C 5-HT1C 5-HT2C-INI 5-HTR2C 5-hydroxytryptamine receptor 2C (5-HT-2C) 5HT-1C HTR1C Serotonin (5-HT3) receptor Serotonin Receptor 2C
Type:
G Protein-Coupled Receptor (GPCR)
Mol. Mass.:
51836.79
Organism:
Homo sapiens (Human)
Description:
P28335
Residue:
458
  
Inhibitor
Name:
BDBM50091438
Synonyms:
(E)-3-(3,4-Dichloro-phenyl)-N-{5-[4-(5-hydroxy-1H-indol-3-yl)-piperidin-1-yl]-pentyl}-acrylamide 3-(3,4-dichlorophenyl)-N-(5-(4-(5-hydroxy-1H-indol-3-yl)piperidin-1-yl)pentyl)acrylamide TCMDC-139245
Type:
Small organic molecule
Emp. Form.:
C27H31Cl2N3O2
Mol. Mass.:
500.46
SMILES:
Oc1ccc2[nH]cc(C3CCN(CCCCCNC(=O)\C=C\c4ccc(Cl)c(Cl)c4)CC3)c2c1
: