Target
5-hydroxytryptamine receptor 2A
Ligand
BDBM50091438
Substrate
Meas. Tech.
ChEMBL_2463 (CHEMBL617351)
Ki
20±n/a nM
Citation
 Witherington, JBordas, VCooper, DGForbes, ITGribble, ADIfe, RJBerkhout, TGohil, JGroot, PH Conformationally restricted indolopiperidine derivatives as potent CCR2B receptor antagonists. Bioorg Med Chem Lett 11:2177-80 (2001)  
Target
Name:
5-hydroxytryptamine receptor 2A
Synonyms:
5-HT-2 5-HT2A 5-hydroxytryptamine receptor 2A (5HT-2A) 5HT2A_HUMAN HTR2A | Serotonin receptor 2A
Type:
undefined
Mol. Mass.:
52607.65
Organism:
Homo sapiens (Human)
Description:
P28223
Residue:
471
  
Inhibitor
Name:
BDBM50091438
Synonyms:
(E)-3-(3,4-Dichloro-phenyl)-N-{5-[4-(5-hydroxy-1H-indol-3-yl)-piperidin-1-yl]-pentyl}-acrylamide 3-(3,4-dichlorophenyl)-N-(5-(4-(5-hydroxy-1H-indol-3-yl)piperidin-1-yl)pentyl)acrylamide TCMDC-139245
Type:
Small organic molecule
Emp. Form.:
C27H31Cl2N3O2
Mol. Mass.:
500.46
SMILES:
Oc1ccc2[nH]cc(C3CCN(CCCCCNC(=O)\C=C\c4ccc(Cl)c(Cl)c4)CC3)c2c1
: