Target
D(2) dopamine receptor
Ligand
BDBM50091438
Substrate
Meas. Tech.
ChEMBL_61142 (CHEMBL670679)
Ki
16±n/a nM
Citation
 Witherington, JBordas, VCooper, DGForbes, ITGribble, ADIfe, RJBerkhout, TGohil, JGroot, PH Conformationally restricted indolopiperidine derivatives as potent CCR2B receptor antagonists. Bioorg Med Chem Lett 11:2177-80 (2001)  
Target
Name:
D(2) dopamine receptor
Synonyms:
D(2) dopamine receptor DOPAMINE D2 Long DRD2 Dopamine D2 receptor Dopamine D2 receptor (D2R) Dopamine2-like | d2
Type:
Cell-surface receptors
Mol. Mass.:
50647.10
Organism:
Homo sapiens (Human)
Description:
P14416
Residue:
443
  
Inhibitor
Name:
BDBM50091438
Synonyms:
(E)-3-(3,4-Dichloro-phenyl)-N-{5-[4-(5-hydroxy-1H-indol-3-yl)-piperidin-1-yl]-pentyl}-acrylamide 3-(3,4-dichlorophenyl)-N-(5-(4-(5-hydroxy-1H-indol-3-yl)piperidin-1-yl)pentyl)acrylamide TCMDC-139245
Type:
Small organic molecule
Emp. Form.:
C27H31Cl2N3O2
Mol. Mass.:
500.46
SMILES:
Oc1ccc2[nH]cc(C3CCN(CCCCCNC(=O)\C=C\c4ccc(Cl)c(Cl)c4)CC3)c2c1
: