Target
C-C chemokine receptor type 5
Ligand
BDBM50105551
Substrate
Meas. Tech.
ChEBML_39629
IC50
89±n/a nM
Citation
 Hale, JJBudhu, RJHolson, EBFinke, PEOates, BMills, SGMacCoss, MGould, SLDeMartino, JASpringer, MSSiciliano, SMalkowitz, LSchleif, WAHazuda, DMiller, MKessler, JDanzeisen, RHolmes, KLineberger, JCarella, ACarver, GEmini, E 1,3,4-Trisubstituted pyrrolidine CCR5 receptor antagonists. Part 2: lead optimization affording selective, orally bioavailable compounds with potent anti-HIV activity. Bioorg Med Chem Lett 11:2741-5 (2001)  
Target
Name:
C-C chemokine receptor type 5
Synonyms:
C-C CKR-5 CC-CKR-5 CCR5 CCR5_HUMAN CHEMR13 HIV-1 fusion coreceptor
Type:
Enzyme
Mol. Mass.:
40540.21
Organism:
Homo sapiens (Human)
Description:
P51681
Residue:
352
  
Inhibitor
Name:
BDBM50105551
Synonyms:
Biphenyl-2-yl-[(3S,4S)-3-phenyl-4-(4-phenyl-piperidin-1-ylmethyl)-pyrrolidin-1-yl]-methanone | CHEMBL92133
Type:
Small organic molecule
Emp. Form.:
C35H36N2O
Mol. Mass.:
500.6731
SMILES:
O=C(N1C[C@H](CN2CCC(CC2)c2ccccc2)[C@H](C1)c1ccccc1)c1ccccc1-c1ccccc1
: