Target
Tyrosine-protein kinase Blk
Ligand
BDBM230107
Substrate
Meas. Tech.
ChEMBL_2019231 (CHEMBL4672809)
IC50
5.0±n/a nM
Citation
 Srivastava, ASKo, SWatterson, SHPattoli, MASkala, SCheng, LObermeier, MTVickery, RDiscenza, LND'Arienzo, CJGillooly, KMTaylor, TLPulicicchio, CMcIntyre, KWYip, SLi, PSun, DWu, DRDai, JWang, CZhang, YWang, BPawluczyk, JKempson, JZhao, RHou, XRampulla, RMathur, AGalella, MASalter-Cid, LBarrish, JCCarter, PHFura, ABurke, JRTino, JA Driving Potency with Rotationally Stable Atropisomers: Discovery of Pyridopyrimidinedione-Carbazole Inhibitors of BTK. ACS Med Chem Lett 11:2195-2203 (2020)  
Target
Name:
Tyrosine-protein kinase Blk
Synonyms:
B lymphoid tyrosine kinase BLK_HUMAN Tyrosine-protein kinase BLK (BLK) | p55-Blk
Type:
Protein
Mol. Mass.:
57711.88
Organism:
Homo sapiens (Human)
Description:
P51451
Residue:
505
  
Inhibitor
Name:
BDBM230107
Synonyms:
US10106559, Example 33 US9334290, 32 | US9850258, Example 33
Type:
Small organic molecule
Emp. Form.:
C31H24Cl2N4O4
Mol. Mass.:
587.453
SMILES:
Cc1c(cccc1-n1c(=O)cc2c(Cl)cccn2c1=O)-c1c(Cl)cc(C(N)=O)c2[nH]c3cc(ccc3c12)C(C)(C)O
: